BDBM198162 2-(5-Acetyl-6-methyl-4-p-tolyl-1,4-dihydropyrimidin-2-ylthio)-N-p-tolylacetamide (4h)
SMILES CC(=O)C1=C(C)NC(SCC(=O)Nc2ccc(C)cc2)=NC1c1ccc(C)cc1
InChI Key InChIKey=PCMLDEKGJGTWDD-UHFFFAOYSA-N
Data  2 IC50
  Tab Delimited (TSV)   2D SDfile   Computed 3D by Vconf -m prep SDfile
Find this compound or compounds like it in BindingDB:
Activity Spreadsheet -- Enzyme Inhibition Constant Data from BindingDB
Found 2 hits for monomerid = 198162
TargetCarboxylic ester hydrolase(Equus caballus (Horse))
Hazara University
LigandPNGBDBM198162(2-(5-Acetyl-6-methyl-4-p-tolyl-1,4-dihydropyrimidi...)
Affinity DataIC50:  5.63E+4nMpH: 8.0Assay Description:The synthesized compounds (each separately) were dissolved in a mixture of DMSO (1 ml) and methanol (9 ml) and then diluted in KH2PO4/K2HPO4 buffer (...
Ligand InfoPC cidPC sid
In DepthDetails ArticlePubMed
TargetAcetylcholinesterase(Electrophorus electricus (Electric eel))
Hazara University
LigandPNGBDBM198162(2-(5-Acetyl-6-methyl-4-p-tolyl-1,4-dihydropyrimidi...)
Affinity DataIC50:  7.63E+3nMpH: 8.0Assay Description:The synthesized compounds (each separately) were dissolved in a mixture of DMSO (1 ml) and methanol (9 ml) and then diluted in KH2PO4/K2HPO4 buffer (...
Ligand InfoPC cidPC sid
In DepthDetails ArticlePubMed