BDBM198166 2-(5-Acetyl-4-(4-(benzyloxy)phenyl)-6-methyl-1,4-dihydropyrimidin-2-ylamino)-N-phenyl acetamide (5d)
SMILES CC(=O)C1=C(C)NC(Nc2ccccc2CC(N)=O)=NC1c1ccc(OCc2ccccc2)cc1
InChI Key InChIKey=PFHFEEAEYMYXEJ-UHFFFAOYSA-N
Data  2 IC50
  Tab Delimited (TSV)   2D SDfile   Computed 3D by Vconf -m prep SDfile
Find this compound or compounds like it in BindingDB:
Activity Spreadsheet -- Enzyme Inhibition Constant Data from BindingDB
Found 2 hits for monomerid = 198166
TargetCarboxylic ester hydrolase(Equus caballus (Horse))
Hazara University
LigandPNGBDBM198166(2-(5-Acetyl-4-(4-(benzyloxy)phenyl)-6-methyl-1,4-d...)
Affinity DataIC50:  1.84E+4nMpH: 8.0Assay Description:The synthesized compounds (each separately) were dissolved in a mixture of DMSO (1 ml) and methanol (9 ml) and then diluted in KH2PO4/K2HPO4 buffer (...
Ligand InfoPC cidPC sid
In DepthDetails ArticlePubMed
TargetAcetylcholinesterase(Electrophorus electricus (Electric eel))
Hazara University
LigandPNGBDBM198166(2-(5-Acetyl-4-(4-(benzyloxy)phenyl)-6-methyl-1,4-d...)
Affinity DataIC50:  1.07E+3nMpH: 8.0Assay Description:The synthesized compounds (each separately) were dissolved in a mixture of DMSO (1 ml) and methanol (9 ml) and then diluted in KH2PO4/K2HPO4 buffer (...
Ligand InfoPC cidPC sid
In DepthDetails ArticlePubMed