BDBM198168 2-(5-Acetyl-4-(4-chlorophenyl)-6-methyl-1,4-dihydropyrimidin-2-ylamino)-N-p-tolylacetamide (5f)
SMILES CC(=O)C1=C(C)NC(NCC(=O)Nc2ccc(C)cc2)=NC1c1ccc(Cl)cc1
InChI Key InChIKey=WUVXZPUPIDXLJL-UHFFFAOYSA-N
Data  2 IC50
  Tab Delimited (TSV)   2D SDfile   Computed 3D by Vconf -m prep SDfile
Find this compound or compounds like it in BindingDB:
Activity Spreadsheet -- Enzyme Inhibition Constant Data from BindingDB
Found 2 hits for monomerid = 198168
TargetCarboxylic ester hydrolase(Equus caballus (Horse))
Hazara University
LigandPNGBDBM198168(2-(5-Acetyl-4-(4-chlorophenyl)-6-methyl-1,4-dihydr...)
Affinity DataIC50:  2.64E+4nMpH: 8.0Assay Description:The synthesized compounds (each separately) were dissolved in a mixture of DMSO (1 ml) and methanol (9 ml) and then diluted in KH2PO4/K2HPO4 buffer (...
Ligand InfoPC cidPC sid
In DepthDetails ArticlePubMed
TargetAcetylcholinesterase(Electrophorus electricus (Electric eel))
Hazara University
LigandPNGBDBM198168(2-(5-Acetyl-4-(4-chlorophenyl)-6-methyl-1,4-dihydr...)
Affinity DataIC50:  3.08E+3nMpH: 8.0Assay Description:The synthesized compounds (each separately) were dissolved in a mixture of DMSO (1 ml) and methanol (9 ml) and then diluted in KH2PO4/K2HPO4 buffer (...
Ligand InfoPC cidPC sid
In DepthDetails ArticlePubMed