BDBM199115 US9221839, 6e
SMILES COc1cnc(C(=O)Nc2ccc(F)c(c2)[C@]23COC[C@H]2S(=O)(=O)N(C)C(=N)N3)c(F)c1
InChI Key InChIKey=LEHXYLCBOVXRTG-DNVCBOLYSA-N
Data  2 KI
  Tab Delimited (TSV)   2D SDfile   Computed 3D by Vconf -m prep SDfile
Find this compound or compounds like it in BindingDB:
Activity Spreadsheet -- Enzyme Inhibition Constant Data from BindingDB
Found 2 hits for monomerid = 199115
TargetBeta-secretase 2(Homo sapiens (Human))
Merck Sharp & Dohme
US Patent
LigandPNGBDBM199115(US9221839, 6e)
Affinity DataKi:  6.90nM ΔG°:  -11.3kcal/molepH: 5.0 T: 2°C. Assay description: Inhibitor IC50s at purified human autoBACE-2 are determined in a time-resolved endpoint proteolysis assay that measures hydrolysis of the QSY7-EISE...
Ligand InfoPC cidPC sid
In DepthDetails US Patent
TargetBeta-secretase 1(Homo sapiens (Human))
Merck Sharp & Dohme
US Patent
LigandPNGBDBM199115(US9221839, 6e)
Affinity DataKi:  15.8nM ΔG°:  -10.8kcal/molepH: 5.0 T: 2°C. Assay description: A homogeneous time-resolved FRET assay can be used to determine IC50 values for inhibitors of the soluble human BACE1 catalytic domain. This assay ...
Ligand InfoPC cidPC sid
In DepthDetails US Patent