BDBM19927 3-arylquinazolinone, 1as::7-hydroxy-3-(4-hydroxyphenyl)-3,4-dihydroquinazolin-4-one
SMILES Oc1ccc(cc1)-n1cnc2cc(O)ccc2c1=O
InChI Key InChIKey=NECCEJFVHJYYDA-UHFFFAOYSA-N
Data  2 IC50  1 EC50
  Tab Delimited (TSV)   2D SDfile   Computed 3D by Vconf -m prep SDfile
Find this compound or compounds like it in BindingDB:
Activity Spreadsheet -- Enzyme Inhibition Constant Data from BindingDB
Found 2 hits for monomerid = 19927
TargetEstrogen receptor beta(Homo sapiens (Human))
Bristol-Myers Squibb
LigandPNGBDBM19927(3-arylquinazolinone, 1as | 7-hydroxy-3-(4-hydroxyp...)
Affinity DataIC50:  8.61E+3nM EC50:  961nM. Assay description: Ligand binding was determined using a scintillation proximity assay with streptavidin-coated SPA beads (Amersham) and biotinylated receptor. Receptor...
In DepthDetails ArticlePubMed
TargetEstrogen receptor(Homo sapiens (Human))
Bristol-Myers Squibb
LigandPNGBDBM19927(3-arylquinazolinone, 1as | 7-hydroxy-3-(4-hydroxyp...)
Affinity DataIC50:  5.36E+4nMpH: 8.0 T: 2°C. Assay description: Ligand binding was determined using a scintillation proximity assay with streptavidin-coated SPA beads (Amersham) and biotinylated receptor. Receptor...
In DepthDetails ArticlePubMed