BDBM19938 2,5,7-trihydroxy-3-(4-hydroxyphenyl)-3,4-dihydroquinazolin-4-one::3-arylquinazolinone, 1aae
SMILES Oc1ccc(cc1)-n1c(=O)[nH]c2cc(O)cc(O)c2c1=O
InChI Key InChIKey=CHNGSGJYDXNOLK-UHFFFAOYSA-N
Data  2 IC50  2 EC50
  Tab Delimited (TSV)   2D SDfile   Computed 3D by Vconf -m prep SDfile
Find this compound or compounds like it in BindingDB:
Activity Spreadsheet -- Enzyme Inhibition Constant Data from BindingDB
Found 2 hits for monomerid = 19938
TargetEstrogen receptor beta(Homo sapiens (Human))
Bristol-Myers Squibb
LigandPNGBDBM19938(2,5,7-trihydroxy-3-(4-hydroxyphenyl)-3,4-dihydroqu...)
Affinity DataIC50:  9.38E+3nM EC50:  1.31E+3nM. Assay description: Ligand binding was determined using a scintillation proximity assay with streptavidin-coated SPA beads (Amersham) and biotinylated receptor. Receptor...
In DepthDetails ArticlePubMed
TargetEstrogen receptor(Homo sapiens (Human))
Bristol-Myers Squibb
LigandPNGBDBM19938(2,5,7-trihydroxy-3-(4-hydroxyphenyl)-3,4-dihydroqu...)
Affinity DataIC50:  7.03E+4nM EC50:  9.27E+3nM. Assay description: Ligand binding was determined using a scintillation proximity assay with streptavidin-coated SPA beads (Amersham) and biotinylated receptor. Receptor...
In DepthDetails ArticlePubMed