BDBM199952 US9227930, 199
SMILES CNC1Cc2ccc(OCCNS(=O)(=O)c3cn(C)cn3)cc2C1Cc1ccccc1
InChI Key InChIKey=ASMWJUHBWHAICQ-UHFFFAOYSA-N
Data  1 KI
  Tab Delimited (TSV)   2D SDfile   Computed 3D by Vconf -m prep SDfile
Find this compound or compounds like it in BindingDB:
Activity Spreadsheet -- Enzyme Inhibition Constant Data from BindingDB
Found 1 hit for monomerid = 199952
LigandPNGBDBM199952(US9227930, 199)
Affinity DataKi: <10nM. Assay description: Radioligand binding to human GlyT1c transporter-expressing membranes was determined as described in Mezler et al., Molecular Pharmacology 74:1705-171...
Ligand InfoPC cidPC sid
In DepthDetails US Patent