BDBM199954 US9227930, 201
SMILES Cn1cnc(c1)S(=O)(=O)NCCOc1cc2C(Cc3ccccc3)C(Cc2cc1F)N1CCC1
InChI Key InChIKey=OBOUDLIOARIIAI-UHFFFAOYSA-N
Data  1 KI
  Tab Delimited (TSV)   2D SDfile   Computed 3D by Vconf -m prep SDfile
Find this compound or compounds like it in BindingDB:
Activity Spreadsheet -- Enzyme Inhibition Constant Data from BindingDB
Found 1 hit for monomerid = 199954
LigandPNGBDBM199954(US9227930, 201)
Affinity DataKi: <100nM. Assay description: Radioligand binding to human GlyT1c transporter-expressing membranes was determined as described in Mezler et al., Molecular Pharmacology 74:1705-171...
Ligand InfoPC cidPC sid
In DepthDetails US Patent