BDBM200218 US9670231, 1.9
SMILES CN(C)[C@H]1CCN(Cc2ccc(cc2C(F)(F)F)C(=O)N[C@@H]2[C@H]3Oc4ccc(Oc5ccnc6NC(=O)CCc56)cc4[C@@H]23)C1
InChI Key InChIKey=HCVNIUYGKPAXGI-KKBDGGKNSA-N
Data  4 IC50
  Tab Delimited (TSV)   2D SDfile   Computed 3D by Vconf -m prep SDfile
Find this compound or compounds like it in BindingDB:
Activity Spreadsheet -- Enzyme Inhibition Constant Data from BindingDB
Found 4 hits for monomerid = 200218
TargetSerine/threonine-protein kinase B-raf [V600E](Homo sapiens (Human))
Beigene
US Patent
LigandPNGBDBM200218(US9670231, 1.9)
Affinity DataIC50:  17nM. Assay description: TBD
Ligand InfoPC cidPC sid
In DepthDetails US Patent
TargetEpidermal growth factor receptor [T790M,L858R](Homo sapiens (Human))
Beigene
US Patent
LigandPNGBDBM200218(US9670231, 1.9)
Affinity DataIC50:  0.300nM. Assay description: TBD
Ligand InfoPC cidPC sid
In DepthDetails US Patent
TargetEpidermal growth factor receptor [L858R](Homo sapiens (Human))
Beigene
US Patent
LigandPNGBDBM200218(US9670231, 1.9)
Affinity DataIC50:  0.300nM. Assay description: TBD
Ligand InfoPC cidPC sid
In DepthDetails US Patent
TargetEpidermal growth factor receptor(Homo sapiens (Human))
Beigene
US Patent
LigandPNGBDBM200218(US9670231, 1.9)
Affinity DataIC50:  1.60nM. Assay description: TBD
Ligand InfoPC cidPC sid
In DepthDetails US Patent