BDBM200429 US10011599, Example 56::US9227969, 56::US9629836, 56
SMILES Cc1nc2cnc3cc(F)c(cc3c2n1C1CCOCC1F)-c1ccc(Oc2ncccn2)cc1Cl
InChI Key InChIKey=RQGOSNUBDGLIMT-UHFFFAOYSA-N
Data  3 IC50
  Tab Delimited (TSV)   2D SDfile   Computed 3D by Vconf -m prep SDfile
Find this compound or compounds like it in BindingDB:
Activity Spreadsheet -- Enzyme Inhibition Constant Data from BindingDB
Found 1 hit for monomerid = 200429
TargetDual specificity mitogen-activated protein kinase kinase 1 [K97R](Homo sapiens (Human))
Novartis
US Patent
LigandPNGBDBM200429(US10011599, Example 56 | US9227969, 56 | US9629836...)
Affinity DataIC50:  280nM. Assay description: The radioactive filter binding assay is standardized using recombinant human activated BRAF (V599E) kinase (Cat No. 14-557) and kinase dead MEK1 (K97...
Ligand InfoPC cidPC sid
In DepthDetails US Patent