BDBM200490 US9670231, 1.22
SMILES CN1CCN(Cc2ccc(cc2Cl)C(=O)N[C@@H]2[C@H]3Oc4ccc(Oc5ccnc6NC(=O)CCc56)cc4[C@@H]23)CC1
InChI Key InChIKey=SGGCXJXLKGOOEM-KCHLEUMXSA-N
Data  4 IC50
  Tab Delimited (TSV)   2D SDfile   Computed 3D by Vconf -m prep SDfile
Find this compound or compounds like it in BindingDB:
Activity Spreadsheet -- Enzyme Inhibition Constant Data from BindingDB
Found 4 hits for monomerid = 200490
TargetSerine/threonine-protein kinase B-raf [V600E](Homo sapiens (Human))
Beigene
US Patent
LigandPNGBDBM200490(US9670231, 1.22)
Affinity DataIC50:  4.80nM. Assay description: TBD
Ligand InfoPC cidPC sid
In DepthDetails US Patent
TargetEpidermal growth factor receptor [T790M,L858R](Homo sapiens (Human))
Beigene
US Patent
LigandPNGBDBM200490(US9670231, 1.22)
Affinity DataIC50:  0.470nM. Assay description: TBD
Ligand InfoPC cidPC sid
In DepthDetails US Patent
TargetEpidermal growth factor receptor [L858R](Homo sapiens (Human))
Beigene
US Patent
LigandPNGBDBM200490(US9670231, 1.22)
Affinity DataIC50:  0.230nM. Assay description: TBD
Ligand InfoPC cidPC sid
In DepthDetails US Patent
TargetEpidermal growth factor receptor(Homo sapiens (Human))
Beigene
US Patent
LigandPNGBDBM200490(US9670231, 1.22)
Affinity DataIC50:  0.800nM. Assay description: TBD
Ligand InfoPC cidPC sid
In DepthDetails US Patent