BDBM200839 US9533999, i-1
SMILES FC(F)(F)c1cccc(CN2C(=O)CS(=O)(=O)c3cccnc23)c1
InChI Key InChIKey=XNKNGAGBNBQFPR-UHFFFAOYSA-N
Data  1 IC50
  Tab Delimited (TSV)   2D SDfile   Computed 3D by Vconf -m prep SDfile
Find this compound or compounds like it in BindingDB:
Activity Spreadsheet -- Enzyme Inhibition Constant Data from BindingDB
Found 1 hit for monomerid = 200839
TargetIntermediate conductance calcium-activated potassium channel protein 4(Homo sapiens (Human))
Boehringer Ingelheim International
US Patent
LigandPNGBDBM200839(US9533999, i-1)
Affinity DataIC50:  290nM. Assay description: HEK293 cells over-expressing human KCa3.1 are used to measure the effects of compounds in inhibiting the KCa3.1 channel function. The assay is based ...
Ligand InfoPC cidPC sid
In DepthDetails US Patent