BDBM202580 2-Chloro-4-[4-(1,2-dihydro-1,5-dimethyl-2-phenyl-3-oxo-3H-pyrazol-4-yl)thiazole (26)
SMILES Cc1c(-c2csc(Cl)n2)c(=O)n(-c2ccccc2)n1C
InChI Key InChIKey=LZJHFPZMQHROFC-UHFFFAOYSA-N
Data  2 IC50
  Tab Delimited (TSV)   2D SDfile   Computed 3D by Vconf -m prep SDfile
Find this compound or compounds like it in BindingDB:
Activity Spreadsheet -- Enzyme Inhibition Constant Data from BindingDB
Found 2 hits for monomerid = 202580
TargetAromatase(Homo sapiens (Human))TBA
LigandPNGBDBM202580(2-Chloro-4-[4-(1,2-dihydro-1,5-dimethyl-2-phenyl-3...)
Affinity DataIC50:  3.30nM. Assay description: Inhibition of recombinant human aromatase
Ligand InfoPC cidPC sid
In DepthDetails PubMed
TargetAromatase(Homo sapiens (Human))TBA
LigandPNGBDBM202580(2-Chloro-4-[4-(1,2-dihydro-1,5-dimethyl-2-phenyl-3...)
Affinity DataIC50:  3.30nMpH: 7.5 T: 2°C. Assay description: This fluorescence-based assay measures the rate at which recombinant human aromatase (baculovirus/insect cell-expressed) converts the substrate 7-m...
Ligand InfoPC cidPC sid
In DepthDetails ArticlePubMed