BDBM204621 1-(2-chloro-6-fluoro-phenyl)-4-methyl-[1,2,4]triazolo[4,3-a]quinoxaline::US9540379, 36
SMILES Cc1nc2ccccc2n2c(nnc12)-c1c(F)cccc1Cl
InChI Key InChIKey=CIHGAHYOOKAOLL-UHFFFAOYSA-N
Data  2 IC50
  Tab Delimited (TSV)   2D SDfile   Computed 3D by Vconf -m prep SDfile
Find this compound or compounds like it in BindingDB:
Activity Spreadsheet -- Enzyme Inhibition Constant Data from BindingDB
Found 2 hits for monomerid = 204621
TargetcGMP-dependent 3',5'-cyclic phosphodiesterase(Homo sapiens (Human))
Boehringer Ingelheim International
US Patent
LigandPNGBDBM204621(1-(2-chloro-6-fluoro-phenyl)-4-methyl-[1,2,4]triaz...)
Affinity DataIC50:  5nM. Assay description: The DNA encoding PDE2A (NM002599) was cloned and the gene was inserted in the baculovirus and the enzyme-protein expressed in SF21-cells. The enzyme ...
Ligand InfoPC cidPC sid
In DepthDetails US Patent
TargetcAMP and cAMP-inhibited cGMP 3',5'-cyclic phosphodiesterase 10A(Homo sapiens (Human))
Boehringer Ingelheim International
US Patent
LigandPNGBDBM204621(1-(2-chloro-6-fluoro-phenyl)-4-methyl-[1,2,4]triaz...)
Affinity DataIC50:  41nM. Assay description: The DNA of PDE10A1 (AB 020593, 2340 bp) was synthesized and cloned into the vector pCR4. TOPO (Entelechon GmbH, Regensburg, Germany). The gene was th...
Ligand InfoPC cidPC sid
In DepthDetails US Patent