BDBM206020 US9255103, 21
SMILES Fc1cccc(OCc2cc3CN(CCn3n2)C(=O)c2ncc(F)cc2F)c1
InChI Key InChIKey=SYDRNVGYRADSCS-UHFFFAOYSA-N
Data  1 EC50
  Tab Delimited (TSV)   2D SDfile   Computed 3D by Vconf -m prep SDfile
Find this compound or compounds like it in BindingDB:
Activity Spreadsheet -- Enzyme Inhibition Constant Data from BindingDB
Found 1 hit for monomerid = 206020
TargetMetabotropic glutamate receptor 5(Homo sapiens (Human))
Vanderbilt University
US Patent
LigandPNGBDBM206020(US9255103, 21)
Affinity DataEC50:  1.28E+3nMpH: 7.4Assay Description:HEK cells transfected with the human mGluR5a receptor (H10H cell line) were plated at 15,000 cells/well in clear-bottomed poly-D-lysine-coated assay ...
Ligand InfoPC cidPC sid
In DepthDetails US Patent