BDBM207611 US10501467, Example 56::US9260440, 56::US9617273, Example 56
SMILES CCCN1Cc2[nH]c3cccc4c3c2c(C1)n[nH]c4=O
InChI Key InChIKey=NEYMAYFFQNJMGK-UHFFFAOYSA-N
Data  3 IC50
  Tab Delimited (TSV)   2D SDfile   Computed 3D by Vconf -m prep SDfile
Find this compound or compounds like it in BindingDB:
Activity Spreadsheet -- Enzyme Inhibition Constant Data from BindingDB
Found 1 hit for monomerid = 207611
TargetPoly [ADP-ribose] polymerase 1(Homo sapiens (Human))
Beigene
US Patent
LigandPNGBDBM207611(US10501467, Example 56 | US9260440, 56 | US9617273...)
Affinity DataIC50:  8.30E+3nM. Assay description: PARP-1 enzymatic assay was conducted using a method modified from HT F Homogeneous PARP Inhibition Assay Kit (Trevigen). 8.8 nM PARP-1 was pre-incuba...
Ligand InfoPC cidPC sid
In DepthDetails US Patent