BDBM208030 6-Bromo-3-((4-chlorophenyl)thio)-1H-indole-2-carboxylic acid::US9233921, 1f
SMILES OC(=O)c1[nH]c2cc(Br)ccc2c1Sc1ccc(Cl)cc1
InChI Key InChIKey=RVJFDZCSUMJRIP-UHFFFAOYSA-N
Data  1 IC50
  Tab Delimited (TSV)   2D SDfile   Computed 3D by Vconf -m prep SDfile
Find this compound or compounds like it in BindingDB:
Activity Spreadsheet -- Enzyme Inhibition Constant Data from BindingDB
Found 1 hit for monomerid = 208030
TargetUracil-DNA glycosylase(Vaccinia virus (strain Copenhagen) (VACV))
University of Pennsylvania
US Patent
LigandPNGBDBM208030( 6-Bromo-3-((4-chlorophenyl)thio)-1H-indole-2-carb...)
Affinity DataIC50:  5.10E+4nMT: 2°C. Assay description: African green monkey kidney BSC-1 cells were grown in Dulbecco's modified Eagle medium (DMEM) supplemented with 10% fetal bovine serum (FBS) (Gibco B...
Ligand InfoPC cidPC sid
In DepthDetails US Patent