BDBM208045 3-((3,4-Dichlorophenyl)thio)-6-methyl-1H-indole-2-carboxylic acid ::US9233921, 21
SMILES Cc1ccc2c(Sc3ccc(Cl)c(Cl)c3)c([nH]c2c1)C(O)=O
InChI Key InChIKey=UGIXPZNFYAQTAH-UHFFFAOYSA-N
Data  1 IC50
  Tab Delimited (TSV)   2D SDfile   Computed 3D by Vconf -m prep SDfile
Find this compound or compounds like it in BindingDB:
Activity Spreadsheet -- Enzyme Inhibition Constant Data from BindingDB
Found 1 hit for monomerid = 208045
TargetUracil-DNA glycosylase(Vaccinia virus (strain Copenhagen) (VACV))
University of Pennsylvania
US Patent
LigandPNGBDBM208045(3-((3,4-Dichlorophenyl)thio)-6-methyl-1H-indole-2-...)
Affinity DataIC50:  3.40E+4nMT: 2°C. Assay description: African green monkey kidney BSC-1 cells were grown in Dulbecco's modified Eagle medium (DMEM) supplemented with 10% fetal bovine serum (FBS) (Gibco B...
Ligand InfoPC cidPC sid
In DepthDetails US Patent