BDBM208051 6-Methyl-3-(phenylthio)-1H-indole-2-carboxylate ::US9233921, 29
SMILES COC(=O)c1[nH]c2cc(C)ccc2c1Sc1ccccc1
InChI Key InChIKey=QUBLUTKSZRAFKW-UHFFFAOYSA-N
Data  1 IC50
  Tab Delimited (TSV)   2D SDfile   Computed 3D by Vconf -m prep SDfile
Find this compound or compounds like it in BindingDB:
Activity Spreadsheet -- Enzyme Inhibition Constant Data from BindingDB
Found 1 hit for monomerid = 208051
TargetUracil-DNA glycosylase(Vaccinia virus (strain Copenhagen) (VACV))
University of Pennsylvania
US Patent
LigandPNGBDBM208051(6-Methyl-3-(phenylthio)-1H-indole-2-carboxylate |...)
Affinity DataIC50:  1.00E+4nMT: 2°C. Assay description: African green monkey kidney BSC-1 cells were grown in Dulbecco's modified Eagle medium (DMEM) supplemented with 10% fetal bovine serum (FBS) (Gibco B...
Ligand InfoPC cidPC sid
In DepthDetails US Patent