BDBM208052 6-Methyl-3-((2,4,5-trichlorophenyl)thio)-1H-indole-2-carboxylic acid ::US9233921, 30
SMILES Cc1ccc2c(Sc3cc(Cl)c(Cl)cc3Cl)c([nH]c2c1)C(O)=O
InChI Key InChIKey=XXCASCVAMIEIHF-UHFFFAOYSA-N
Data  1 IC50
  Tab Delimited (TSV)   2D SDfile   Computed 3D by Vconf -m prep SDfile
Find this compound or compounds like it in BindingDB:
Activity Spreadsheet -- Enzyme Inhibition Constant Data from BindingDB
Found 1 hit for monomerid = 208052
TargetUracil-DNA glycosylase(Vaccinia virus (strain Copenhagen) (VACV))
University of Pennsylvania
US Patent
LigandPNGBDBM208052(6-Methyl-3-((2,4,5-trichlorophenyl)thio)-1H-indole...)
Affinity DataIC50:  2.50E+4nMT: 2°C. Assay description: African green monkey kidney BSC-1 cells were grown in Dulbecco's modified Eagle medium (DMEM) supplemented with 10% fetal bovine serum (FBS) (Gibco B...
Ligand InfoPC cidPC sid
In DepthDetails US Patent