BDBM208055 3-(3-((3,5-Dichlorophenyl)thio)-6-methyl-1H-indol-2-yl)propanamide ::US9233921, 24a
SMILES Cc1ccc2c(Sc3cc(Cl)cc(Cl)c3)c(CC(N)=O)[nH]c2c1
InChI Key InChIKey=IWRLJIDHDZUKJF-UHFFFAOYSA-N
Data  1 IC50
  Tab Delimited (TSV)   2D SDfile   Computed 3D by Vconf -m prep SDfile
Find this compound or compounds like it in BindingDB:
Activity Spreadsheet -- Enzyme Inhibition Constant Data from BindingDB
Found 1 hit for monomerid = 208055
TargetUracil-DNA glycosylase(Vaccinia virus (strain Copenhagen) (VACV))
University of Pennsylvania
US Patent
LigandPNGBDBM208055(3-(3-((3,5-Dichlorophenyl)thio)-6-methyl-1H-indol-...)
Affinity DataIC50:  42nMT: 2°C. Assay description: African green monkey kidney BSC-1 cells were grown in Dulbecco's modified Eagle medium (DMEM) supplemented with 10% fetal bovine serum (FBS) (Gibco B...
Ligand InfoPC cidPC sid
In DepthDetails US Patent