BDBM210845 US9290467, 15
SMILES CC1(C)CC2N(C1)CC\C=C\COc1ccc(C[C@H](NC2=O)C(=O)NC2(CC2)C#N)cc1Cl
InChI Key InChIKey=YQNUJUMKAQIILV-RDDUPGIKSA-N
Data  1 IC50
  Tab Delimited (TSV)   2D SDfile   Computed 3D by Vconf -m prep SDfile
Find this compound or compounds like it in BindingDB:
Activity Spreadsheet -- Enzyme Inhibition Constant Data from BindingDB
Found 1 hit for monomerid = 210845
TargetProcathepsin L(Homo sapiens (Human))
Hoffmann-La Roche
US Patent
LigandPNGBDBM210845(US9290467, 15)
Affinity DataIC50:  168nMpH: 6.5Assay Description:Enzyme activity is measured by observing the increase in fluorescence intensity caused by cleavage of a peptide substrate containing a fluorophore wh...
Ligand InfoPC cidPC sid
In DepthDetails US Patent