BDBM215762 US9296748, III-3
SMILES Cc1cc(cn(C)c1=O)-c1nc2cccnc2n1Cc1ccccc1
InChI Key InChIKey=RVXRIWVCWCMYIJ-UHFFFAOYSA-N
Data  1 IC50
  Tab Delimited (TSV)   2D SDfile   Computed 3D by Vconf -m prep SDfile
Find this compound or compounds like it in BindingDB:
Activity Spreadsheet -- Enzyme Inhibition Constant Data from BindingDB
Found 1 hit for monomerid = 215762
TargetBromodomain-containing protein 4 [44-168](Homo sapiens (Human))
Boehringer Ingelheim International
US Patent
LigandPNGBDBM215762(US9296748, III-3)
Affinity DataIC50:  45nM. Assay description: Compounds are diluted in serial dilution 1:5 in assay buffer from 10 mM stock in DMSO (100 μM start concentration) in white OptiPlate-384 (Perki...
Ligand InfoPC cidPC sid
In DepthDetails US Patent