BDBM217396 CLTERHKI(hyp(C4F9))HRLLQE::Leu9hyp(C4F9)
SMILES CC[C@H](C)[C@H](NC(=O)[C@H](CCCCN)NC(=O)[C@H](Cc1cnc[nH]1)NC(=O)[C@H](CCCNC(N)=N)NC(=O)[C@H](CCC(O)=O)NC(=O)[C@@H](NC(=O)[C@H](CC(C)C)NC(=O)[C@@H](N)CS)[C@@H](C)O)C(=O)N1C[C@@H](C[C@H]1C(=O)N[C@@H](Cc1cnc[nH]1)C(=O)N[C@@H](CCCNC(N)=N)C(=O)N[C@@H](CC(C)C)C(=O)N[C@@H](CC(C)C)C(=O)N[C@@H](CCC(N)=O)C(=O)N[C@@H](CCC(O)=O)C(O)=O)OC(C(F)(F)F)(C(F)(F)F)C(F)(F)F
InChI Key
Data  1 Kd
  Tab Delimited (TSV)   2D SDfile   Computed 3D by Vconf -m prep SDfile
Find this compound or compounds like it in BindingDB:
Activity Spreadsheet -- Enzyme Inhibition Constant Data from BindingDB
Found 1 hit for monomerid = 217396
TargetEstradiol-bound Estrogen receptor [255-595](Homo sapiens (Human))
University of Delaware
LigandPNGBDBM217396(CLTERHKI(hyp(C4F9))HRLLQE | Leu9hyp(C4F9))
Affinity DataKd: >1.50E+5nMpH: 7.4 T: 2°C. Assay description: Peptides and the ERα LBD were diluted in 1× PBS buffer [140 mM NaCl, 2.7 mM KCl, 10 mM K2HPO4, and 2 mM KH2PO4 (pH 7.4)]. Peptide concentrations...
Ligand InfoPC cidPC sid
In DepthDetails ArticlePubMed