BDBM218547 US9284333, 16lg::US9884860, Example 16lg
SMILES CC[C@@H](NC(=O)c1cc(C(=O)N[C@H](C)c2ccc(F)cc2)c2C(C)OCCn12)c1ccccc1
InChI Key InChIKey=HTYVUSVTXVUCTQ-JIUDAOPXSA-N
Data  2 IC50
  Tab Delimited (TSV)   2D SDfile   Computed 3D by Vconf -m prep SDfile
Find this compound or compounds like it in BindingDB:
Activity Spreadsheet -- Enzyme Inhibition Constant Data from BindingDB
Found 2 hits for monomerid = 218547
TargetPotassium channel subfamily K member 3(Homo sapiens (Human))
Sanofi
US Patent
LigandPNGBDBM218547(US9284333, 16lg | US9884860, Example 16lg)
Affinity DataIC50:  50nMT: 2°C. Assay description: Human TASK-1 channels were expressed in Xenopus oocytes. For this purpose, oocytes were isolated from Xenopus laevis and defoliculated. Subsequently,...
Ligand InfoPC cidPC sid
In DepthDetails US Patent
TargetPotassium channel subfamily K member 3(Homo sapiens (Human))
Sanofi
US Patent
LigandPNGBDBM218547(US9284333, 16lg | US9884860, Example 16lg)
Affinity DataIC50:  46nMT: 2°C. Assay description: Human TASK-1 channels were expressed in Xenopus oocytes. For this purpose, oocytes were isolated from Xenopus laevis and defoliculated. Subsequently,...
Ligand InfoPC cidPC sid
In DepthDetails US Patent