BDBM218573 US9284333, 16nh::US9884860, Example 16nh
SMILES CC[C@@H](NC(=O)c1cc(C(=O)N2CCC[C@@H]2C)c2COCCn12)c1ccccc1Cl
InChI Key InChIKey=CHNZTBOCAMRXQQ-HNAYVOBHSA-N
Data  2 IC50
  Tab Delimited (TSV)   2D SDfile   Computed 3D by Vconf -m prep SDfile
Find this compound or compounds like it in BindingDB:
Activity Spreadsheet -- Enzyme Inhibition Constant Data from BindingDB
Found 2 hits for monomerid = 218573
TargetPotassium channel subfamily K member 3(Homo sapiens (Human))
Sanofi
US Patent
LigandPNGBDBM218573(US9284333, 16nh | US9884860, Example 16nh)
Affinity DataIC50:  90nMT: 2°C. Assay description: Human TASK-1 channels were expressed in Xenopus oocytes. For this purpose, oocytes were isolated from Xenopus laevis and defoliculated. Subsequently,...
Ligand InfoPC cidPC sid
In DepthDetails US Patent
TargetPotassium channel subfamily K member 3(Homo sapiens (Human))
Sanofi
US Patent
LigandPNGBDBM218573(US9284333, 16nh | US9884860, Example 16nh)
Affinity DataIC50:  90nMT: 2°C. Assay description: Human TASK-1 channels were expressed in Xenopus oocytes. For this purpose, oocytes were isolated from Xenopus laevis and defoliculated. Subsequently,...
Ligand InfoPC cidPC sid
In DepthDetails US Patent