BDBM221339 US9303023, 38
SMILES COc1ccc2[nH]cc(CCn3cc(NC(=O)c4ncoc4-c4cccc(c4)C(F)(F)F)cn3)c2c1
InChI Key InChIKey=HUAYNAQDQBVYRU-UHFFFAOYSA-N
Data  1 IC50
  Tab Delimited (TSV)   2D SDfile   Computed 3D by Vconf -m prep SDfile
Find this compound or compounds like it in BindingDB:
Activity Spreadsheet -- Enzyme Inhibition Constant Data from BindingDB
Found 1 hit for monomerid = 221339
TargetOrexin receptor type 2(Homo sapiens (Human))
Actelion Pharmaceuticals
US Patent
LigandPNGBDBM221339(US9303023, 38)
Affinity DataIC50:  16nMT: 2°C. Assay description: Chinese hamster ovary (CHO) cells expressing the human orexin-1 receptor and the human orexin-2 receptor, respectively, are grown in culture medium (...
Ligand InfoPC cidPC sid
In DepthDetails US Patent