BDBM221344 US9303023, 43
SMILES COc1ccc2[nH]cc(CCn3cc(NC(=O)c4ncsc4-c4cccc(Cl)c4)cn3)c2c1
InChI Key InChIKey=NQOFQYUCAABBRN-UHFFFAOYSA-N
Data  1 IC50
  Tab Delimited (TSV)   2D SDfile   Computed 3D by Vconf -m prep SDfile
Find this compound or compounds like it in BindingDB:
Activity Spreadsheet -- Enzyme Inhibition Constant Data from BindingDB
Found 1 hit for monomerid = 221344
TargetOrexin receptor type 2(Homo sapiens (Human))
Actelion Pharmaceuticals
US Patent
LigandPNGBDBM221344(US9303023, 43)
Affinity DataIC50:  20nMT: 2°C. Assay description: Chinese hamster ovary (CHO) cells expressing the human orexin-1 receptor and the human orexin-2 receptor, respectively, are grown in culture medium (...
Ligand InfoPC cidPC sid
In DepthDetails US Patent