BDBM221367 US9303023, 63
SMILES COc1ccc2[nH]cc(CCn3cc(NC(=O)c4ncoc4-c4cccc(C)c4)cn3)c2n1
InChI Key InChIKey=OWUGHOGLSOEBHT-UHFFFAOYSA-N
Data  1 IC50
  Tab Delimited (TSV)   2D SDfile   Computed 3D by Vconf -m prep SDfile
Find this compound or compounds like it in BindingDB:
Activity Spreadsheet -- Enzyme Inhibition Constant Data from BindingDB
Found 1 hit for monomerid = 221367
TargetOrexin receptor type 2(Homo sapiens (Human))
Actelion Pharmaceuticals
US Patent
LigandPNGBDBM221367(US9303023, 63)
Affinity DataIC50:  15nMT: 2°C. Assay description: Chinese hamster ovary (CHO) cells expressing the human orexin-1 receptor and the human orexin-2 receptor, respectively, are grown in culture medium (...
Ligand InfoPC cidPC sid
In DepthDetails US Patent