BDBM221565 US9303045, 51
SMILES CN1C2COCC1CC(C2)OC(=O)c1cn(CCF)c2ncccc12
InChI Key InChIKey=YYSFUWXCUOEGDB-UHFFFAOYSA-N
Data  1 IC50
  Tab Delimited (TSV)   2D SDfile   Computed 3D by Vconf -m prep SDfile
Find this compound or compounds like it in BindingDB:
Activity Spreadsheet -- Enzyme Inhibition Constant Data from BindingDB
Found 1 hit for monomerid = 221565
Target5-hydroxytryptamine receptor 3A(Homo sapiens (Human))
Takeda Pharmaceutical
US Patent
LigandPNGBDBM221565(US9303045, 51)
Affinity DataIC50:  0.600nMT: 2°C. Assay description: The 5HT3 antagonist activity of the compounds of the invention was determined by measuring the ability of the compounds to inhibit the calcium flux a...
Ligand InfoPC cidPC sid
In DepthDetails US Patent