BDBM221853 US9314468, Table 7, Compound 140
SMILES NC(=O)Cn1c2ccccc2c2ccnc(CN(CCCN3CCNCC3)[C@H]3CCCc4cccnc34)c12
InChI Key InChIKey=KSQLGAFWFIKFHD-MHZLTWQESA-N
Data  1 IC50
  Tab Delimited (TSV)   2D SDfile   Computed 3D by Vconf -m prep SDfile
Find this compound or compounds like it in BindingDB:
Activity Spreadsheet -- Enzyme Inhibition Constant Data from BindingDB
Found 1 hit for monomerid = 221853
TargetC-X-C chemokine receptor type 4(Homo sapiens (Human))
Altiris Therapeutics
US Patent
LigandPNGBDBM221853(US9314468, Table 7, Compound 140)
Affinity DataIC50:  9nMT: 2°C. Assay description: Functional modulation of CXCR4 was determined by calcium mobilization assay using leukemic lymphoid CEM cells, which naturally express high levels of...
Ligand InfoPC cidPC sid
In DepthDetails US Patent