BDBM221869 US9314468, Table 8, Compound 7
SMILES NCCCCN(Cc1nccc2c3ccccc3n(CC(=O)[I]=O)c12)C1CCCc2cccnc12
InChI Key InChIKey=MNAZTJAVYQATRR-UHFFFAOYSA-N
Data  1 IC50
  Tab Delimited (TSV)   2D SDfile   Computed 3D by Vconf -m prep SDfile
Find this compound or compounds like it in BindingDB:
Activity Spreadsheet -- Enzyme Inhibition Constant Data from BindingDB
Found 1 hit for monomerid = 221869
TargetC-X-C chemokine receptor type 4(Homo sapiens (Human))
Altiris Therapeutics
US Patent
LigandPNGBDBM221869(US9314468, Table 8, Compound 7)
Affinity DataIC50:  8.10nM. Assay description: This assay measures the change in impedance that occurs when cells are stimulated with SDF-1a. Changes in shape and cytoskeleton result in a change o...
Ligand InfoPC cidPC sid
In DepthDetails US Patent