BDBM221870 US9314468, Table 8, Compound 8
SMILES NCCCCN(Cc1nccc2c3ccccc3n(CCCN3CCNCC3)c12)C1CCCc2cccnc12
InChI Key InChIKey=KRDNCRHWZIFVKV-UHFFFAOYSA-N
Data  1 IC50
  Tab Delimited (TSV)   2D SDfile   Computed 3D by Vconf -m prep SDfile
Find this compound or compounds like it in BindingDB:
Activity Spreadsheet -- Enzyme Inhibition Constant Data from BindingDB
Found 1 hit for monomerid = 221870
TargetC-X-C chemokine receptor type 4(Homo sapiens (Human))
Altiris Therapeutics
US Patent
LigandPNGBDBM221870(US9314468, Table 8, Compound 8)
Affinity DataIC50:  8.30nM. Assay description: This assay measures the change in impedance that occurs when cells are stimulated with SDF-1a. Changes in shape and cytoskeleton result in a change o...
Ligand InfoPC cidPC sid
In DepthDetails US Patent