BDBM22225 3-(3-methyl-4-{5-[4-(propan-2-yloxy)-3-(trifluoromethyl)phenyl]-1,2,4-oxadiazol-3-yl}phenyl)butanoic acid::3-arylpropionic acid derivative, 7b
SMILES CC(C)Oc1ccc(cc1C(F)(F)F)-c1nc(no1)-c1ccc(cc1C)C(C)CC(O)=O
InChI Key InChIKey=NPYHQSNOTFSWLT-UHFFFAOYSA-N
Data  3 EC50
  Tab Delimited (TSV)   2D SDfile   Computed 3D by Vconf -m prep SDfile
Find this compound or compounds like it in BindingDB:
Activity Spreadsheet -- Enzyme Inhibition Constant Data from BindingDB
Found 3 hits for monomerid = 22225
TargetSphingosine 1-phosphate receptor 1(Homo sapiens (Human))
Merck Research Laboratories
LigandPNGBDBM22225(3-(3-methyl-4-{5-[4-(propan-2-yloxy)-3-(trifluorom...)
Affinity DataEC50:  0.120nMpH: 7.4 T: 2°C. Assay description: EC50s were determined by measuring the binding of [35S]-GTP-gamma-S to S1P receptors expressed in transfected Chinese hamster ovary (CHO) cell membr...
In DepthDetails ArticlePubMed
TargetSphingosine 1-phosphate receptor 5(Homo sapiens (Human))
Merck Research Laboratories
LigandPNGBDBM22225(3-(3-methyl-4-{5-[4-(propan-2-yloxy)-3-(trifluorom...)
Affinity DataEC50:  3.90nMpH: 7.4 T: 2°C. Assay description: EC50s were determined by measuring the binding of [35S]-GTP-gamma-S to S1P receptors expressed in transfected Chinese hamster ovary (CHO) cell membr...
In DepthDetails ArticlePubMed
TargetSphingosine 1-phosphate receptor 3(Homo sapiens (Human))
Merck Research Laboratories
LigandPNGBDBM22225(3-(3-methyl-4-{5-[4-(propan-2-yloxy)-3-(trifluorom...)
Affinity DataEC50:  184nMpH: 7.4 T: 2°C. Assay description: EC50s were determined by measuring the binding of [35S]-GTP-gamma-S to S1P receptors expressed in transfected Chinese hamster ovary (CHO) cell membr...
In DepthDetails ArticlePubMed