BDBM222943 US9315500, 2.13
SMILES Cc1ccc(Nc2nc(N[C@@H]3CCCC[C@@H]3N)cc3cn[nH]c(=O)c23)c2cccnc12
InChI Key InChIKey=VODQEQCIUFDKHJ-FUHWJXTLSA-N
Data  1 IC50
  Tab Delimited (TSV)   2D SDfile   Computed 3D by Vconf -m prep SDfile
Find this compound or compounds like it in BindingDB:
Activity Spreadsheet -- Enzyme Inhibition Constant Data from BindingDB
Found 1 hit for monomerid = 222943
TargetTyrosine-protein kinase SYK [2-635](Homo sapiens (Human))
Novartis
US Patent
LigandPNGBDBM222943(US9315500, 2.13)
Affinity DataIC50:  7nMpH: 7.5 T: 2°C. Assay description: All assays were performed in 384 well microtiter plates. Each assay plate contained 8-point serial dilutions for 40 test compounds, as well as four 8...
Ligand InfoPC cidPC sid
In DepthDetails US Patent