BDBM222950 US9315500, 2.20
SMILES N[C@H]1CCCC[C@H]1Nc1cc2cn[nH]c(=O)c2c(Nc2cccc3cccnc23)n1
InChI Key InChIKey=KHCJZWOEBZSSHF-JKSUJKDBSA-N
Data  1 IC50
  Tab Delimited (TSV)   2D SDfile   Computed 3D by Vconf -m prep SDfile
Find this compound or compounds like it in BindingDB:
Activity Spreadsheet -- Enzyme Inhibition Constant Data from BindingDB
Found 1 hit for monomerid = 222950
TargetTyrosine-protein kinase SYK [2-635](Homo sapiens (Human))
Novartis
US Patent
LigandPNGBDBM222950(US9315500, 2.20)
Affinity DataIC50:  45nMpH: 7.5 T: 2°C. Assay description: All assays were performed in 384 well microtiter plates. Each assay plate contained 8-point serial dilutions for 40 test compounds, as well as four 8...
Ligand InfoPC cidPC sid
In DepthDetails US Patent