BDBM223051 US9320737, IV.9
SMILES COc1nccc2oc(cc12)-c1cnc2ccc(OCCCS(C)(=O)=NC#N)nn12
InChI Key InChIKey=QPQGESIICFUNKN-UHFFFAOYSA-N
Data  1 IC50
  Tab Delimited (TSV)   2D SDfile   Computed 3D by Vconf -m prep SDfile
Find this compound or compounds like it in BindingDB:
Activity Spreadsheet -- Enzyme Inhibition Constant Data from BindingDB
Found 1 hit for monomerid = 223051
TargetIsoform 2 of MAP kinase-interacting serine/threonine-protein kinase 1 (MNK1a) 344D](Homo sapiens (Human))
Bayer Intellectual Property
US Patent
LigandPNGBDBM223051(US9320737, IV.9)
Affinity DataIC50:  9nMpH: 7.5 T: 2°C. Assay description: For the assay 50 mL of a 100 fold concentrated solution of the test compound in DMSO was pipetted into a black low volume 384 well microtiter plate (...
Ligand InfoPC cidPC sid
In DepthDetails US Patent