BDBM223127 2-((5-phenylfuran-2-yl)methylene)hydrazinecarboxamide (4a)
SMILES NC(=O)N\N=C\c1ccc(o1)-c1ccccc1
InChI Key InChIKey=OEXTZFFHFSVLLY-RIYZIHGNSA-N
Data  1 IC50
  Tab Delimited (TSV)   2D SDfile   Computed 3D by Vconf -m prep SDfile
Find this compound or compounds like it in BindingDB:
Activity Spreadsheet -- Enzyme Inhibition Constant Data from BindingDB
Found 1 hit for monomerid = 223127
TargetProtein arginine N-methyltransferase 5(Homo sapiens (Human))
Sichuan University
LigandPNGBDBM223127(2-((5-phenylfuran-2-yl)methylene)hydrazinecarboxam...)
Affinity DataIC50:  1.20E+4nMT: 2°C. Assay description: All in vitro enzymatic assays were carried out by Shanghai ChemPartner Co. (998 Halei Road, Pudong New Area, Shanghai, 201203, China). To measure the...
In DepthDetails ArticlePubMed