BDBM223549 US9321748, 9
SMILES CC(C)n1cc(nn1)-c1cc(cnc1N)-c1ccc2n(C)ccc2c1
InChI Key InChIKey=FZKOFIRZDRGWHN-UHFFFAOYSA-N
Data  4 IC50
  Tab Delimited (TSV)   2D SDfile   Computed 3D by Vconf -m prep SDfile
Find this compound or compounds like it in BindingDB:
Activity Spreadsheet -- Enzyme Inhibition Constant Data from BindingDB
Found 4 hits for monomerid = 223549
TargetLeucine-rich repeat serine/threonine-protein kinase 2 [970-2527,G2019S](Homo sapiens (Human))
H. Lundbeck
US Patent
LigandPNGBDBM223549(US9321748, 9)
Affinity DataIC50:  540nMpH: 8.5 T: 2°C. Assay description: The kinase reaction buffer consists of 50 mM Tris pH 8.5, 0.01% BRIJ-35, 10 mM MgCl2, 1 mM EGTA, and 2 mM DTT. In the assay, 1 nM LRRK2 WT or 250 pM ...
Ligand InfoPC cidPC sid
In DepthDetails US Patent
TargetLeucine-rich repeat serine/threonine-protein kinase 2(Homo sapiens (Human))
H. Lundbeck
Curated by ChEMBL
LigandPNGBDBM223549(US9321748, 9)
Affinity DataIC50:  540nM. Assay description: Displacement of [3H]-pentazocine from sigma1 receptor in guinea pig brain membranes after 120 mins by liquid scintillation counting
Ligand InfoPC cidPC sid
In DepthDetails ArticlePubMed
TargetLeucine-rich repeat serine/threonine-protein kinase 2(Homo sapiens (Human))
H. Lundbeck
Curated by ChEMBL
LigandPNGBDBM223549(US9321748, 9)
Affinity DataIC50:  550nM. Assay description: Inhibition of recombinant human wild type GST-tagged LRRK2 (970 to 2527 residues) preincubated for 30 mins followed by fluorescein-LRRKtide substrate...
Ligand InfoPC cidPC sid
In DepthDetails ArticlePubMed
TargetLeucine-rich repeat serine/threonine-protein kinase 2 [970-2527](Homo sapiens (Human))
H. Lundbeck
US Patent
LigandPNGBDBM223549(US9321748, 9)
Affinity DataIC50:  550nMpH: 8.5 T: 2°C. Assay description: The kinase reaction buffer consists of 50 mM Tris pH 8.5, 0.01% BRIJ-35, 10 mM MgCl2, 1 mM EGTA, and 2 mM DTT. In the assay, 1 nM LRRK2 WT or 250 pM ...
Ligand InfoPC cidPC sid
In DepthDetails US Patent