BDBM223562 US9321748, 22
SMILES CC(C)n1cc(nn1)-c1cc(cnc1N)-c1ccc(C(=O)N2CCOCC2)c(Cl)c1
InChI Key InChIKey=LIUVQANZJIWADM-UHFFFAOYSA-N
Data  2 IC50
  Tab Delimited (TSV)   2D SDfile   Computed 3D by Vconf -m prep SDfile
Find this compound or compounds like it in BindingDB:
Activity Spreadsheet -- Enzyme Inhibition Constant Data from BindingDB
Found 2 hits for monomerid = 223562
TargetLeucine-rich repeat serine/threonine-protein kinase 2 [970-2527](Homo sapiens (Human))
H. Lundbeck
US Patent
LigandPNGBDBM223562(US9321748, 22)
Affinity DataIC50:  290nMpH: 8.5 T: 2°C. Assay description: The kinase reaction buffer consists of 50 mM Tris pH 8.5, 0.01% BRIJ-35, 10 mM MgCl2, 1 mM EGTA, and 2 mM DTT. In the assay, 1 nM LRRK2 WT or 250 pM ...
Ligand InfoPC cidPC sid
In DepthDetails US Patent
TargetLeucine-rich repeat serine/threonine-protein kinase 2 [970-2527,G2019S](Homo sapiens (Human))
H. Lundbeck
US Patent
LigandPNGBDBM223562(US9321748, 22)
Affinity DataIC50:  290nMpH: 8.5 T: 2°C. Assay description: The kinase reaction buffer consists of 50 mM Tris pH 8.5, 0.01% BRIJ-35, 10 mM MgCl2, 1 mM EGTA, and 2 mM DTT. In the assay, 1 nM LRRK2 WT or 250 pM ...
Ligand InfoPC cidPC sid
In DepthDetails US Patent