BDBM223574 US9321750, 6
SMILES CS(=O)(=O)Nc1ccc2N(Cc3ccc(cc3)C(O)(C(F)(F)F)C(F)(F)F)C(=O)CCc2c1
InChI Key InChIKey=UMMOWMVAZSAQIA-UHFFFAOYSA-N
Data  1 IC50
  Tab Delimited (TSV)   2D SDfile   Computed 3D by Vconf -m prep SDfile
Find this compound or compounds like it in BindingDB:
Activity Spreadsheet -- Enzyme Inhibition Constant Data from BindingDB
Found 1 hit for monomerid = 223574
TargetNuclear receptor ROR-gamma(Homo sapiens (Human))
Innov17
US Patent
LigandPNGBDBM223574(US9321750, 6)
Affinity DataIC50: <1.00E+4nM. Assay description: Compound binding to the human RORγ LBD was assessed using the Human RORγ Assay System (INDIGO Biosciences Inc.) as per manufacturer's i...
Ligand InfoPC cidPC sid
In DepthDetails US Patent