BDBM224811 US9333197, Hydroxybupropion
SMILES CC(NC(C)(C)CO)C(=O)c1cccc(Cl)c1
InChI Key InChIKey=AKOAEVOSDHIVFX-UHFFFAOYSA-N
Data  1 IC50
  Tab Delimited (TSV)   2D SDfile   Computed 3D by Vconf -m prep SDfile
Find this compound or compounds like it in BindingDB:
Activity Spreadsheet -- Enzyme Inhibition Constant Data from BindingDB
Found 1 hit for monomerid = 224811
TargetCytochrome P450 2B6(Homo sapiens (Human))
Gilead Sciences
US Patent
LigandPNGBDBM224811(US9333197, Hydroxybupropion)
Affinity DataIC50:  1.92E+4nM. Assay description: Six test compound concentrations (0.1, 0.25, 1, 2.5, 10, 25 μM in DMSO; final DMSO concentration=0.3%) are incubated with human liver microsomes...
In DepthDetails US Patent