BDBM225201 US9328118, 121
SMILES Cn1cnc2c(nc(nc12)C#N)-c1ccc(OCCC2CCN(CC(=O)N3CCC(F)(F)C3)CC2)c(c1)C(F)(F)F
InChI Key InChIKey=JVXRUVYAGNZZRJ-UHFFFAOYSA-N
Data  1 IC50
  Tab Delimited (TSV)   2D SDfile   Computed 3D by Vconf -m prep SDfile
Find this compound or compounds like it in BindingDB:
Activity Spreadsheet -- Enzyme Inhibition Constant Data from BindingDB
Found 1 hit for monomerid = 225201
TargetCathepsin S(Homo sapiens (Human))
Astellas Pharma
US Patent
LigandPNGBDBM225201(US9328118, 121)
Affinity DataIC50:  2.40nM. Assay description: 5 μL of a human cathepsin S enzyme (R&D1183-CY-010) was added to a 96-well plate so as to be 20 ng/well. Next, 10-fold dilution of the test comp...
Ligand InfoPC cidPC sid
In DepthDetails US Patent