BDBM22551 4-(cyclohexylmethyl)-2-[3-(1H-imidazol-4-ylmethyl)phenyl]-4,5-dihydro-1,3-oxazole::4-Benzyl-1H-imidazole derivative, 29
SMILES C(C1COC(=N1)c1cccc(Cc2cnc[nH]2)c1)C1CCCCC1
InChI Key InChIKey=MWHGHYXTLRCVSG-UHFFFAOYSA-N
Data  1 KI
  Tab Delimited (TSV)   2D SDfile   Computed 3D by Vconf -m prep SDfile
Find this compound or compounds like it in BindingDB:
Activity Spreadsheet -- Enzyme Inhibition Constant Data from BindingDB
Found 1 hit for monomerid = 22551
TargetHistamine H3 receptor(Homo sapiens (Human))
Vu University Amsterdam
LigandPNGBDBM22551(4-(cyclohexylmethyl)-2-[3-(1H-imidazol-4-ylmethyl)...)
Affinity DataKi:  708nM ΔG°:  -8.38kcal/molepH: 7.4 T: 2°C. Assay description: Ligand displacement assays were performed on CHO cells membranes expressing hH3R. Retained radioactivity was determined by liquid scintillation count...
In DepthDetails ArticlePubMed