BDBM226002 FXR_95
SMILES CC(=O)Nc1ccc(NC(=O)c2c3CN(CCc3nn2-c2ccccc2)S(=O)(=O)c2cccs2)cc1
InChI Key InChIKey=DKSCPLWWQOUMEH-UHFFFAOYSA-N
Data  1 IC50
  Tab Delimited (TSV)   2D SDfile   Computed 3D by Vconf -m prep SDfile
Find this compound or compounds like it in BindingDB:
Activity Spreadsheet -- Enzyme Inhibition Constant Data from BindingDB
Found 1 hit for monomerid = 226002
TargetBile acid receptor(Homo sapiens (Human))
D3R/Abbott
LigandPNGBDBM226002(FXR_95)
Affinity DataIC50:  3.22E+4nMpH: 7.4Assay Description:The assay buffer contained 50 mM HEPES (pH 7.4), 10 mM NaCl, 5 mM MgCl2 and 0.01% CHAPS. The reactions were incubated for 30 min in the presence of [...
Ligand InfoPC cidPC sid
In DepthDetails PubMed