BDBM227478 US9334268, 10
SMILES CCCCCc1nc2c(N)nc3ccccc3c2n1CC(C)(C)OCCN
InChI Key InChIKey=UKWYNGPGDNDJRN-UHFFFAOYSA-N
Data  2 EC50
  Tab Delimited (TSV)   2D SDfile   Computed 3D by Vconf -m prep SDfile
Find this compound or compounds like it in BindingDB:
Activity Spreadsheet -- Enzyme Inhibition Constant Data from BindingDB
Found 2 hits for monomerid = 227478
TargetToll-like receptor 7(Homo sapiens (Human))
Hoffmann-La Roche
US Patent
LigandPNGBDBM227478(US9334268, 10)
Affinity DataEC50:  152nM. Assay description: For TLR8 and TLR7 activity testing, HEK-Blue human TLR8 or TLR7 cells, respectively, (Invivogen, San Diego, Calif., USA) transfected with a SEAP repo...
Ligand InfoPC cidPC sid
In DepthDetails US Patent
TargetToll-like receptor 8(Homo sapiens (Human))
Hoffmann-La Roche
US Patent
LigandPNGBDBM227478(US9334268, 10)
Affinity DataEC50:  2.70E+3nM. Assay description: For TLR8 and TLR7 activity testing, HEK-Blue human TLR8 or TLR7 cells, respectively, (Invivogen, San Diego, Calif., USA) transfected with a SEAP repo...
Ligand InfoPC cidPC sid
In DepthDetails US Patent