BDBM227940 4-[(2-Fluoro-5-hydroxy-4-methylphenyl)amino]-8-({[(2R)-2-hydroxypropyl](methyl)amino}methyl)-6,11-dihydro-5H-pyrido[2,3-b][1,5]benzodiazepin-5-one::US10047096, 201
SMILES C[C@@H](O)CN(C)Cc1ccc2Nc3nccc(Nc4cc(O)c(C)cc4F)c3C(=O)Nc2c1
InChI Key InChIKey=SSHPGUNPHGPTSE-CQSZACIVSA-N
Data  2 IC50
  Tab Delimited (TSV)   2D SDfile   Computed 3D by Vconf -m prep SDfile
Find this compound or compounds like it in BindingDB:
Activity Spreadsheet -- Enzyme Inhibition Constant Data from BindingDB
Found 2 hits for monomerid = 227940
TargetPlatelet-derived growth factor receptor beta(Homo sapiens (Human))
Bayer Pharma Aktiengesellschaft
US Patent
LigandPNGBDBM227940(4-[(2-Fluoro-5-hydroxy-4-methylphenyl)amino]-8-({[...)
Affinity DataIC50:  1.35nMpH: 7.5 T: 2°C. Assay description: The kinase used was a recombinant fusion protein composed of N-terminal GST and a C-terminal fragment of human PDGFRβ (amino acids R561-L1106), expr...
Ligand InfoPC cidPC sid
In DepthDetails US Patent
TargetVascular endothelial growth factor receptor 2(Homo sapiens (Human))
Bayer Pharma Aktiengesellschaft
US Patent
LigandPNGBDBM227940(4-[(2-Fluoro-5-hydroxy-4-methylphenyl)amino]-8-({[...)
Affinity DataIC50:  0.728nMpH: 7.0Assay Description:The kinase used was a recombinant fusion protein composed of N-terminal GST and a C-terminal fragment of human KDR (amino acids D807-V1356), expresse...
Ligand InfoPC cidPC sid
In DepthDetails US Patent