BDBM233007 H-D-Ser-Ala-Arg-NH-(CH2)7-NH2 (6)
SMILES C[C@H](NC(=O)[C@@H](N)CO)C(=O)N[C@@H](CCCNC(N)=N)C(=O)NCCCCCCCN
InChI Key InChIKey=BUUVGWCTOLEQGG-KKUMJFAQSA-N
Data  3 KI
  Tab Delimited (TSV)   2D SDfile   Computed 3D by Vconf -m prep SDfile
Find this compound or compounds like it in BindingDB:
Activity Spreadsheet -- Enzyme Inhibition Constant Data from BindingDB
Found 3 hits for monomerid = 233007
TargetSerine protease 1(Homo sapiens (Human))
Medical University of Bialystok
LigandPNGBDBM233007(H-D-Ser-Ala-Arg-NH-(CH2)7-NH2 (6))
Affinity DataKi:  3.00E+4nMpH: 7.5Assay Description:Determination of amidolytic activity was performed as described previously [Okada et al., Chem. Pharm. Bull., 36:1289-1297]. Detailed description of ...
Ligand InfoPC cidPC sid
In DepthDetails ArticlePubMed
TargetUrokinase-type plasminogen activator(Homo sapiens (Human))
Medical University of Bialystok
LigandPNGBDBM233007(H-D-Ser-Ala-Arg-NH-(CH2)7-NH2 (6))
Affinity DataKi:  2.44E+5nMpH: 8.8Assay Description:Determination of amidolytic activity was performed as described previously [Okada et al., Chem. Pharm. Bull., 36:1289-1297]. Detailed description of ...
Ligand InfoPC cidPC sid
In DepthDetails ArticlePubMed
TargetPlasminogen(Homo sapiens (Human))
Medical University of Bialystok
LigandPNGBDBM233007(H-D-Ser-Ala-Arg-NH-(CH2)7-NH2 (6))
Affinity DataKi:  3.64E+5nMpH: 7.4Assay Description:Determination of amidolytic activity was performed as described previously [Okada et al., Chem. Pharm. Bull., 36:1289-1297]. Detailed description of ...
Ligand InfoPC cidPC sid
In DepthDetails ArticlePubMed