BDBM233381 US9346829, 19
SMILES O=C(O[C@@H]1C[C@@H]2COC[C@H](C1)N2)c1cn(-c2ccnc(c2)C#N)c2ccccc12
InChI Key InChIKey=YTBBUCWPGWCCJZ-ALXJQNPVSA-N
Data  1 IC50
  Tab Delimited (TSV)   2D SDfile   Computed 3D by Vconf -m prep SDfile
Find this compound or compounds like it in BindingDB:
Activity Spreadsheet -- Enzyme Inhibition Constant Data from BindingDB
Found 1 hit for monomerid = 233381
Target5-hydroxytryptamine receptor 3A(Homo sapiens (Human))
Takeda Pharmaceutical
US Patent
LigandPNGBDBM233381(US9346829, 19)
Affinity DataIC50:  3.68nMT: 2°C. Assay description: The 5-HT3 antagonist activity of the compounds of the invention was determined by measuring the ability of the compounds to inhibit the calcium flux ...
Ligand InfoPC cidPC sid
In DepthDetails US Patent