BDBM233407 US9351965, 14
SMILES Cc1nc2ccc(cc2s1)-c1n[nH]c2ccc(cc12)C(=O)N[C@@H]1CCC[C@](O)(Cc2c(F)cccc2F)C1
InChI Key
Data  1 IC50
  Tab Delimited (TSV)   2D SDfile   Computed 3D by Vconf -m prep SDfile
Find this compound or compounds like it in BindingDB:
Activity Spreadsheet -- Enzyme Inhibition Constant Data from BindingDB
Found 1 hit for monomerid = 233407
TargetMitogen-activated protein kinase 1(Mus musculus (Mouse))
Merck Sharp & Dohme
US Patent
LigandPNGBDBM233407(US9351965, 14)
Affinity DataIC50:  15.4nM. Assay description: Activated ERK2 activity was also determined in the IMAP assay format using the procedure outlined above. 1 μl of 25× compound was added to 1...
Ligand InfoPC cidPC sid
In DepthDetails US Patent